ID,Hora de inicio,Hora de finalización,Correo electrónico,Nombre,Total de puntos,Comentarios del cuestionario,Puntos: Identificador (Indicar las cuatro últimas cifras del DNI con la letra. Ejemplo: 0171W),Comentarios: Identificador (Indicar las cuatro últimas cifras del DNI con la letra. Ejemplo: 0171W),Edad (Ejemplo: 54),Puntos: Edad (Ejemplo: 54),Comentarios: Edad (Ejemplo: 54),Peso (En kilogramos. Ejemplo: 74.5),Puntos: Peso (En kilogramos. Ejemplo: 74.5),Comentarios: Peso (En kilogramos. Ejemplo: 74.5),Altura (En centímetros. Ejemplo: 180),Puntos: Altura (En centímetros. Ejemplo: 180),Comentarios: Altura (En centímetros. Ejemplo: 180),Sexo biológico,Puntos: Sexo biológico,Movilidad,Puntos: Movilidad,Comunicación,Puntos: Comunicación,¿Utilizas algún  dispositivo de apoyo o  sistema aumentativo y  alternativo para la  comunicación  (SAAC)?,Puntos: ¿Utilizas algún  dispositivo de apoyo o  sistema aumentativo y  alternativo para la  comunicación  (SAAC)?,"Si has respondido ""Sí"" en la pregunta anterior, indica cuál utilizas. (Ejemplo: Tablero en papel con pictogramas)",Indica cuánto de recomendable crees que es la práctica de actividad física en personas con movilidad reducida.,Puntos: Indica cuánto de recomendable crees que es la práctica de actividad física en personas con movilidad reducida.,"¿Practicas algún tipo de actividad física frecuentemente y/o acudes periódicamente a sesiones de rehabilitación? Recuerda la opción marcada, ya que la usará a partir de la pregunta 17.","Puntos: ¿Practicas algún tipo de actividad física frecuentemente y/o acudes periódicamente a sesiones de rehabilitación? Recuerda la opción marcada, ya que la usará a partir de la pregunta 17.", ¿Cuáles son las principales dificultades para practicar ejercicio o incrementar su frecuencia? (Marque todas las opciones que considere apropiadas),Puntos:  ¿Cuáles son las principales dificultades para practicar ejercicio o incrementar su frecuencia? (Marque todas las opciones que considere apropiadas),¿Qué necesitarías para incrementar la práctica de ejercicio o actividad física? (Ejemplos: Formar parte de un grupo o usar juegos adaptados),"¿Cuántas horas a la semana sueles dedicar a leer, ver la tele, estar con el ordenador o a realizar manualidades?","Puntos: ¿Cuántas horas a la semana sueles dedicar a leer, ver la tele, estar con el ordenador o a realizar manualidades?","Si procede, ¿cuántas horas a la semana le dedicas a andar o pasear con la silla de ruedas (empujándola tú)?","Puntos: Si procede, ¿cuántas horas a la semana le dedicas a andar o pasear con la silla de ruedas (empujándola tú)?","Si procede, ¿Cuántas horas a la semana le dedicas a realizar tareas del hogar como lavar platos, limpiar el polvo o barrer el suelo?","Puntos: Si procede, ¿Cuántas horas a la semana le dedicas a realizar tareas del hogar como lavar platos, limpiar el polvo o barrer el suelo?",No es necesario que continúes con el cuestionario si en la pregunta 11 ( ¿Practicas algún tipo de actividad física frecuentemente?)  respondió que NO.,Puntos: No es necesario que continúes con el cuestionario si en la pregunta 11 ( ¿Practicas algún tipo de actividad física frecuentemente?)  respondió que NO.,"Indica el tipo de actividad física que sueles realizar: paseos, deporte, rehabilitación (Ejemplo:  Salgo a pasear a diario, hago rehabilitación de 2 a 3 veces en semana y piscina los fines de semana)","Si practicas ejercicio de forma regular, ya sea como parte de un programa de rehabilitación o como opción personal, valora tu motivación.","Puntos: Si practicas ejercicio de forma regular, ya sea como parte de un programa de rehabilitación o como opción personal, valora tu motivación.",Indica cuántas veces por semana realizas la actividad,Puntos: Indica cuántas veces por semana realizas la actividad,"¿Cuánto dura una sesión en promedio? (Exprese la cantidad de tiempo en minutos. Si la duración de diferentes sesiones no es homogénea, estime un promedio. Ejemplo: 45)","Puntos: ¿Cuánto dura una sesión en promedio? (Exprese la cantidad de tiempo en minutos. Si la duración de diferentes sesiones no es homogénea, estime un promedio. Ejemplo: 45)",Selecciona la intensidad del ejercicio o actividad física,Puntos: Selecciona la intensidad del ejercicio o actividad física,¿Dónde sueles realizar la mayor parte del ejercicio o actividad física?,Puntos: ¿Dónde sueles realizar la mayor parte del ejercicio o actividad física?,"Indica otros espacios donde también realizas ejercicio o actividad física (Lista ordenada de mayor a menor frecuencia. Ejemplo: En piscina, gimnasio,...)",¿Cuál es el propósito del ejercicio la actividad física?,Puntos: ¿Cuál es el propósito del ejercicio la actividad física?,¿Algún personal sanitario te ha recomendado la realización de ejercicio o actividad física?,Puntos: ¿Algún personal sanitario te ha recomendado la realización de ejercicio o actividad física?,"¿Crees que actualmente tienes una menor motivación para realizar actividad física o ejercicio que en años anteriores o cuando eras adolescente o niño/a? (Contesta si procede, esta cuestión está má...","Puntos: ¿Crees que actualmente tienes una menor motivación para realizar actividad física o ejercicio que en años anteriores o cuando eras adolescente o niño/a? (Contesta si procede, esta cuestión está má...","Si marcó que Sí en la pregunta anterior, indica algunas razones del porqué.",¿Utilizas algún dispositivo de apoyo o aparato especial para realizar actividad física?.,Puntos: ¿Utilizas algún dispositivo de apoyo o aparato especial para realizar actividad física?.,"Si en la pregunta anterior marcó que sí, indica cuáles.",¿Usas algún software/aplicación que te ayude a monitorizar o promover la actividad física?,Puntos: ¿Usas algún software/aplicación que te ayude a monitorizar o promover la actividad física?," Si en la pregunta anterior marcó que sí, indica cuál.","¿Cómo prefieres realizar actividad física? ( La actividad en grupo incluiría la práctica de deporte como boccia, baloncesto en silla de ruedas, etc.)","Puntos: ¿Cómo prefieres realizar actividad física? ( La actividad en grupo incluiría la práctica de deporte como boccia, baloncesto en silla de ruedas, etc.)",Pregunta abierta: ¿qué tipo de actividades que se desarrollen en el centro de tu asociación crees que podrían aumentar tu motivación en el desarrollo de la actividad física?,¿Crees que tu práctica de ejercicio o actividad física puede estar condicionada por tus habilidades o sistemas de apoyo para la comunicación?,"Puntos: ¿Te resultaría cómodo llevar un dispositivo tipo reloj, pulsera o cinturón que permita “monitorizar” el desarrollo de tu actividad física o ejercicio? (por ejemplo, para contar los pasos que das o...","¿Te resultaría cómodo llevar un dispositivo tipo reloj, pulsera o cinturón que permita “monitorizar” el desarrollo de tu actividad física o ejercicio? (por ejemplo, para contar los pasos que das o...","¿Te resultaría cómodo llevar un dispositivo tipo reloj, pulsera o cinturón que permita “monitorizar” el desarrollo de tu actividad física o ejercicio? (por ejemplo, para contar los pasos que das o..."
1,11/23/21 17:23:08,11/23/21 17:34:15,anonymous,,,,,,24,,,45,,,168,,,Masculino,1,Se te transporta en una silla de ruedas manual en todo tipo de espacios.  Necesitas la asistencia física de una o dos personas o de una grúa para los traslados.,5,Presentas limitaciones tanto para entender como para hacerte entender para la mayoría de las personas y pareces tener una comprensión limitada de los mensajes. La comunicación es raramente eficaz aun con interlocutores conocidos.,5,No,1,,Recomendable,4,Sí,2,Otros motivos;,1000000,Que la familia tuviese más tiempo disponible,0,0,,0,,0,Continuar,1,Rehabilitación,Me da igual,3,3,3,60,60,Actividad ligera,1,En el centro de la asociación (ej. ASPACE),4,"Piscina, fisioterapia, hipoterapia",Ambos,3,Sí,1,No,2,,No,2,,No,2,,En solitario,1,Aula multisensorial,No sabe / no contesta,3,No sabe / No contesta,3
2,11/23/21 22:29:35,11/23/21 22:35:54,anonymous,,,,,,34,,,83,,,144,,,Femenino,2,"Caminas en la mayoría de los espacios, pero en la escuela/trabajo usas un dispositivo manual auxiliar para tu seguridad. En los espacios exteriores y en la comunidad utilizas una silla de ruedas para distancias largas. Eres capaz de subir y bajar escaleras con un pasamanos.",2,"Puedes: a) entender y hacerte entender ocasionalmente de forma eficaz, o; b) hacerte entender bien, pero entiende de forma limitada; o c) entender bien, pero hacerte entender está muy limitado. La comunicación es en ocasiones eficaz con interlocutores conocidos.",4,No,1,,Muy recomendable,5,Sí,2,No contar con el material deportivo adaptado adecuado;Ausencia de recursos para la práctica deportiva cerca de mi residencia;,110,Usar juegos adaptados,8h,8,6h,6,0,0,Finalizar,0,,,,,0,,0,,,,,,,,,,,,,,,,,,,,,,,,,
3,11/24/21 21:22:58,11/24/21 21:29:44,anonymous,,,,,,36,,,60,,,160,,,Masculino,1,Se te transporta en una silla de ruedas manual en todo tipo de espacios.  Necesitas la asistencia física de una o dos personas o de una grúa para los traslados.,5,Presentas limitaciones tanto para entender como para hacerte entender para la mayoría de las personas y pareces tener una comprensión limitada de los mensajes. La comunicación es raramente eficaz aun con interlocutores conocidos.,5,No,1,,Muy recomendable,5,No,1,Otros motivos;,1000000,No puedo hacerlo por mi mismo,No ago ninguna de esas actividades ,0,,0,,0,Finalizar,0,,,,,0,,0,,,,,,,,,,,,,,,,,,,,,,,,,
4,11/24/21 23:34:45,11/25/21 0:04:09,anonymous,,,,,,28,,,80,,,178,,,Femenino,2,Se te transporta en una silla de ruedas manual en todo tipo de espacios.  Necesitas la asistencia física de una o dos personas o de una grúa para los traslados.,5,Presentas limitaciones tanto para entender como para hacerte entender para la mayoría de las personas y pareces tener una comprensión limitada de los mensajes. La comunicación es raramente eficaz aun con interlocutores conocidos.,5,No,1,,Muy recomendable,5,Sí,2,Ausencia de recursos para la práctica deportiva cerca de mi residencia;Otros motivos;,1000010,Qué las piscinas públicas estén adactadas para todas las personas con grandes dificultades,Una hora,1,,0,,0,Continuar,1,Rehabilitación 2 días por semana,Me gusta,4,2 días por semana,2,50 minutos,50,,,En el centro de la asociación (ej. ASPACE),4,En gabinete de fisioterapia,Ambos,3,No,0,No,2,,No,2,,No,2,,En grupo,2,Rehabilitación en piscina,No sabe / no contesta,3,No sabe / No contesta,3
5,10/30/22 13:26:26,10/30/22 13:30:52,anonymous,,,,,,34,,,50,,,155,,,Femenino,2,Se te transporta en una silla de ruedas manual en todo tipo de espacios.  Necesitas la asistencia física de una o dos personas o de una grúa para los traslados.,5,Presentas limitaciones tanto para entender como para hacerte entender para la mayoría de las personas y pareces tener una comprensión limitada de los mensajes. La comunicación es raramente eficaz aun con interlocutores conocidos.,5,No,1,,No sabe / No contesta,3,Sí,2,"Desinterés personal, en general;",100000,CONTAR CON MÁS RECURSOS HUMANOS,NO RESPONDIDA,,,0,,0,Continuar,1,REHABILITACIÓN 2 VECES EN SEMANA,Me gusta,4,DOS,2,30,30,Actividad ligera,1,En el centro de la asociación (ej. ASPACE),4,,Rehabilitación / Intervención del centro,1,No,0,No,2,,No,2,,No,2,,Ambos,3,LA HIDROTERAPIA,No,1,No,1
6,10/30/22 13:31:47,10/30/22 13:35:54,anonymous,,,,,,61,,,59.6,,,165,,,Masculino,1,"Puedes caminar en casa, en espacios exteriores y en la comunidad. Eres capaz de correr y saltar, pero tu equilibrio es limitado.",1,"Igual que en la opción anterior, pero el ritmo de la conversación es lento. Es posible que necesites más tiempo para entender mensajes, formar mensajes, y/o reparar errores de comunicación con interlocutores, ya sean conocidos y desconocidos.",2,No,1,,Recomendable,4,Sí,2,"Desinterés personal, en general;",100000,CONTAR CON MÁS PERSONAL DE APOYO,7,7,2-3,"2,5",1,1,Continuar,1,"PASEOS A DIARIO, REHABILITACIÓN 1 VEZ A LA SEMANA",Me gusta,4,1,1,30,30,Actividad ligera,1,En el centro de la asociación (ej. ASPACE),4,,Rehabilitación / Intervención del centro,1,Sí,1,No,2,,No,2,,No,2,,Ambos,3,LA PISCINA,No,1,Sí,2
7,10/30/22 13:43:38,10/30/22 13:48:06,anonymous,,,,,,58,,,79,,,170,,,Femenino,2,Se te transporta en una silla de ruedas manual en todo tipo de espacios.  Necesitas la asistencia física de una o dos personas o de una grúa para los traslados.,5,"Puedes: a) entender y hacerte entender ocasionalmente de forma eficaz, o; b) hacerte entender bien, pero entiende de forma limitada; o c) entender bien, pero hacerte entender está muy limitado. La comunicación es en ocasiones eficaz con interlocutores conocidos.",4,No,1,,No sabe / No contesta,3,Sí,2,"Desinterés personal, en general;",100000,MAYOR APOYO Y RECURSOS HUMANOS,3,3,,0,,0,Continuar,1,REHABILITACIÓN UNA VEZ POR SEMANA,Me gusta,4,1,1,30,30,Actividad ligera,1,En el centro de la asociación (ej. ASPACE),4,,Rehabilitación / Intervención del centro,1,No,0,Sí,1,"ANTES PODÍA DESPLAZARME EN TRAYECTOS CORTOS, PERO YA LLEVO MUCHO TIEMPO EN SILLA DE RUEDAS, NO PUEDO MANTENERME EN PIR Y HE COGIDO KILLOS",No,2,,No,2,,Ambos,3,HIDROTERAPIA,No,1,No sabe / No contesta,3
8,10/30/22 13:48:08,10/30/22 13:52:50,anonymous,,,,,,51,,,59,,,158,,,Femenino,2,Se te transporta en una silla de ruedas manual en todo tipo de espacios.  Necesitas la asistencia física de una o dos personas o de una grúa para los traslados.,5,Presentas limitaciones tanto para entender como para hacerte entender para la mayoría de las personas y pareces tener una comprensión limitada de los mensajes. La comunicación es raramente eficaz aun con interlocutores conocidos.,5,No,1,,No sabe / No contesta,3,Sí,2,Otros motivos;,1000000,MAS RECURSOS HUMANOS,NO RESPONDIDA,,,0,,0,Continuar,1,REABAHILITACIÓN 2 VECES/SEMANA,Me gusta poco,2,2,2,30,30,Actividad ligera,1,En el centro de la asociación (ej. ASPACE),4,,Rehabilitación / Intervención del centro,1,No,0,No,2,,No,2,,No,2,,En solitario,1,LA PISCINA,No sabe / no contesta,3,No,1
9,10/30/22 13:53:04,10/30/22 13:56:22,anonymous,,,,,,57,,,57.2,,,170,,,Masculino,1,Se te transporta en una silla de ruedas manual en todo tipo de espacios.  Necesitas la asistencia física de una o dos personas o de una grúa para los traslados.,5,Presentas limitaciones tanto para entender como para hacerte entender para la mayoría de las personas y pareces tener una comprensión limitada de los mensajes. La comunicación es raramente eficaz aun con interlocutores conocidos.,5,No,1,,No sabe / No contesta,3,Sí,2,Otros motivos;,1000000,MÁS PERSONAL DE APOYO,NO RESPONDIDA,,,0,,0,Continuar,1,REHABILITACIÓN 4 VECES / SEMANA,Me gusta,4,4,4,45,45,Actividad ligera,1,En el centro de la asociación (ej. ASPACE),4,,Rehabilitación / Intervención del centro,1,No,0,Sí,1,"ME SIENTO MÁS MAYOR Y TORPE, TEMO CAERME",No,2,,No,2,,En solitario,1,LA PISCINA,No,1,No,1
10,10/30/22 13:56:35,10/30/22 14:00:12,anonymous,,,,,,33,,,68,,,166,,,Femenino,2,Se te transporta en una silla de ruedas manual en todo tipo de espacios.  Necesitas la asistencia física de una o dos personas o de una grúa para los traslados.,5,Presentas limitaciones tanto para entender como para hacerte entender para la mayoría de las personas y pareces tener una comprensión limitada de los mensajes. La comunicación es raramente eficaz aun con interlocutores conocidos.,5,No,1,,No sabe / No contesta,3,Sí,2,"Desinterés personal, en general;",100000,MÁS RECURSOS HUMANOS,NO RESPONDIDA,,,0,,0,Continuar,1,REHABILITACIÓN 1 VEZ / SEMANA,No me gusta nada,1,1,1,30,30,Actividad ligera,1,En el centro de la asociación (ej. ASPACE),4,,Rehabilitación / Intervención del centro,1,No,0,No,2,,No,2,,No,2,,En solitario,1,PISCINA,No,1,No,1
11,10/30/22 14:00:16,10/30/22 14:04:28,anonymous,,,,,,46,,,37.2,,,155,,,Femenino,2,Usas un dispositivo con ruedas en la mayoría de los espacios para desplazarte. Necesitas la asistencia de una o dos personas para los traslados. A veces puedes usar una silla motorizada y caminar distancias cortas en espacios interiores con la ayuda de un andador.,4,Presentas limitaciones tanto para entender como para hacerte entender para la mayoría de las personas y pareces tener una comprensión limitada de los mensajes. La comunicación es raramente eficaz aun con interlocutores conocidos.,5,No,1,,No sabe / No contesta,3,Sí,2,Otros motivos;,1000000,RECURSOS HUMANOS,NO RESPONDIDA,,2.5 H,"2,5",,0,Continuar,1,REHABILITACIÓN 2 VECES / SEMANA. PASEAR UN RATO TODOS LOS DÍAS.,Me gusta poco,2,2,2,30,30,Actividad ligera,1,En el centro de la asociación (ej. ASPACE),4,,Rehabilitación / Intervención del centro,1,Sí,1,Sí,1,MIEDO A CAER,No,2,,No,2,,Ambos,3,HIDROTERAPIA,No,1,No,1
12,10/30/22 14:04:30,10/30/22 14:09:06,anonymous,,,,,,26,,,80,,,165,,,Masculino,1,Usas un dispositivo con ruedas en la mayoría de los espacios para desplazarte. Necesitas la asistencia de una o dos personas para los traslados. A veces puedes usar una silla motorizada y caminar distancias cortas en espacios interiores con la ayuda de un andador.,4,"Puedes: a) entender y hacerte entender ocasionalmente de forma eficaz, o; b) hacerte entender bien, pero entiende de forma limitada; o c) entender bien, pero hacerte entender está muy limitado. La comunicación es en ocasiones eficaz con interlocutores conocidos.",4,Sí,2,CUADERNO CON PICTOGRAMAS (SOPORTE PAPEL) Y BIMODAL (ORAL+SIGNOS),Recomendable,4,Sí,2,Otros motivos;,1000000,MÁS APOYOS Y RECURSOS HUMANOS,14,14,3,3,,0,Continuar,1,PASEOS DIARIOS. REBAHILITACIÓN 2-3 VECES/SEMANA. PISCINA 1 VEZ / SEMANA,Me gusta mucho,5,3-4,"3,5",30 ,30,Actividad ligera,1,En el centro de la asociación (ej. ASPACE),4,GIMNASIO DEL CENTRO. PISCINA.,Rehabilitación / Intervención del centro,1,Sí,1,No,2,,Sí,1,ANDADOR,No,2,,Ambos,3,,No,1,Sí,2
13,10/30/22 14:09:10,10/30/22 14:13:42,anonymous,,,,,,45,,,54,,,170,,,Masculino,1,Se te transporta en una silla de ruedas manual en todo tipo de espacios.  Necesitas la asistencia física de una o dos personas o de una grúa para los traslados.,5,Presentas limitaciones tanto para entender como para hacerte entender para la mayoría de las personas y pareces tener una comprensión limitada de los mensajes. La comunicación es raramente eficaz aun con interlocutores conocidos.,5,No,1,,Muy recomendable,5,Sí,2,No contar con el material deportivo adaptado adecuado;,100,MÁS PROFESIONALES DE LA MATERIA,NO RESPONDIDA,,,0,,0,Continuar,1,FISIOTERAPIA 1-2/SEMANA,Me gusta,4,1-2/SEMANA,"1,5",30,30,Actividad ligera,1,En el centro de la asociación (ej. ASPACE),4,,Rehabilitación / Intervención del centro,1,Sí,1,Sí,1,EDAD. ENFERMEDAD RESPORATORIA.,Sí,1,BIPEDESTADOR,No,2,,En solitario,1,OCIO Y TIEMPO LIBRE,Sí,2,Sí,2
14,10/30/22 16:18:56,10/30/22 16:22:53,anonymous,,,,,,45,,,90,,,185,,,Masculino,1,"Puedes caminar en casa, en espacios exteriores y en la comunidad. Eres capaz de correr y saltar, pero tu equilibrio es limitado.",1,Presentas limitaciones tanto para entender como para hacerte entender para la mayoría de las personas y pareces tener una comprensión limitada de los mensajes. La comunicación es raramente eficaz aun con interlocutores conocidos.,5,No,1,,No sabe / No contesta,3,Sí,2,Barreras físicas del entorno;,1,VOLVER A PRACTICAR BOCCIA,NO RESPONDIDA,,,0,,0,Continuar,1,REHABILITACIÓN. PASEOS DE VEZ EN CUANDO.,Me gusta,4,1 /SEMANA,1,45,45,Actividad ligera,1,En el centro de la asociación (ej. ASPACE),4,,Ambos,3,No,0,No,2,,No,2,,No,2,,Ambos,3,BOCCIA,No sabe / no contesta,3,Sí,2
15,10/30/22 16:22:55,10/30/22 16:26:12,anonymous,,,,,,36,,,40,,,145,,,Masculino,1,Se te transporta en una silla de ruedas manual en todo tipo de espacios.  Necesitas la asistencia física de una o dos personas o de una grúa para los traslados.,5,Presentas limitaciones tanto para entender como para hacerte entender para la mayoría de las personas y pareces tener una comprensión limitada de los mensajes. La comunicación es raramente eficaz aun con interlocutores conocidos.,5,No,1,,No sabe / No contesta,3,Sí,2,Barreras físicas del entorno;,1,MAS RECURSOS EN EL CENTRO,10,10,,0,,0,Continuar,1,REHABILITACIÓN 1/SEMANA. PASEO CON ALGUIEN QUE EMPUJEW LA SILLA.,Me gusta mucho,5,1,1,45,45,Actividad ligera,1,En el centro de la asociación (ej. ASPACE),4,,Rehabilitación / Intervención del centro,1,No,0,No,2,,No,2,,No,2,,Ambos,3,,No sabe / no contesta,3,Sí,2
16,10/30/22 16:26:14,10/30/22 16:29:06,anonymous,,,,,,25,,,31.4,,,140,,,Masculino,1,Se te transporta en una silla de ruedas manual en todo tipo de espacios.  Necesitas la asistencia física de una o dos personas o de una grúa para los traslados.,5,Presentas limitaciones tanto para entender como para hacerte entender para la mayoría de las personas y pareces tener una comprensión limitada de los mensajes. La comunicación es raramente eficaz aun con interlocutores conocidos.,5,No,1,,Muy recomendable,5,Sí,2,No contar con el material deportivo adaptado adecuado;,100,MÁS PERSONAL,NO RESPONDIDA,,,0,,0,Continuar,1,REHABILITACION 1-2/SEMANA,Me gusta,4,1-2,"1,5",30,30,Actividad ligera,1,En el centro de la asociación (ej. ASPACE),4,,Rehabilitación / Intervención del centro,1,Sí,1,No,2,,No,2,,No,2,,En solitario,1,OCIO Y TIEMPO LIBRE,Sí,2,No,1
17,10/30/22 16:29:12,10/30/22 16:31:17,anonymous,,,,,,38,,,48,,,150,,,Femenino,2,Se te transporta en una silla de ruedas manual en todo tipo de espacios.  Necesitas la asistencia física de una o dos personas o de una grúa para los traslados.,5,Presentas limitaciones tanto para entender como para hacerte entender para la mayoría de las personas y pareces tener una comprensión limitada de los mensajes. La comunicación es raramente eficaz aun con interlocutores conocidos.,5,No,1,,Muy recomendable,5,Sí,2,No contar con el material deportivo adaptado adecuado;,100,MAS PROFESIONALES,NO RESPONDIDA,,,0,,0,Continuar,1,REHABILITACION,Me gusta,4,1-2,"1,5",30,30,Actividad ligera,1,En el centro de la asociación (ej. ASPACE),4,,Rehabilitación / Intervención del centro,1,Sí,1,No,2,,No,2,,No,2,,En solitario,1,OCIO,Sí,2,Sí,2
18,10/31/22 0:10:59,10/31/22 5:21:56,anonymous,,,,,,65,,,49,,,160,,,Masculino,1,Se te transporta en una silla de ruedas manual en todo tipo de espacios.  Necesitas la asistencia física de una o dos personas o de una grúa para los traslados.,5,"Igual que en la opción anterior, pero el ritmo de la conversación es lento. Es posible que necesites más tiempo para entender mensajes, formar mensajes, y/o reparar errores de comunicación con interlocutores, ya sean conocidos y desconocidos.",2,No,1,,Muy recomendable,5,Sí,2,No contar con el material deportivo adaptado adecuado;,100,PROFESINALES,NO RESPONDIDA,,,0,,0,Continuar,1,REHABILITACIÓN,Me gusta mucho,5,1-2 VECES,"1,5",30,30,Actividad ligera,1,En el centro de la asociación (ej. ASPACE),4,,Rehabilitación / Intervención del centro,1,Sí,1,Sí,1,EDAD. DEFORMIDAD.,No,2,,No,2,,Ambos,3,OCIO,Sí,2,Sí,2
19,10/31/22 5:22:00,10/31/22 5:33:07,anonymous,,,,,,45,,,76,,,167,,,Masculino,1,Se te transporta en una silla de ruedas manual en todo tipo de espacios.  Necesitas la asistencia física de una o dos personas o de una grúa para los traslados.,5,Presentas limitaciones tanto para entender como para hacerte entender para la mayoría de las personas y pareces tener una comprensión limitada de los mensajes. La comunicación es raramente eficaz aun con interlocutores conocidos.,5,Sí,2,IMÁGENES,Muy recomendable,5,Sí,2,No contar con el material deportivo adaptado adecuado;,100,MÁS PERSONAL,7,7,,0,,0,Continuar,1,REHABILITACIÓN,Me gusta mucho,5,1-2,"1,5",30,30,Actividad ligera,1,En el centro de la asociación (ej. ASPACE),4,,Rehabilitación / Intervención del centro,1,Sí,1,No,2,,No,2,,No,2,,Ambos,3,OCIO,Sí,2,Sí,2